Details

    • Type: Bug
    • Status: Resolved
    • Priority: Minor
    • Resolution: Fixed
    • Affects Version/s: 1.6.10
    • Fix Version/s: 1.6.10
    • Component/s: mod_avmd
    • Labels:
      None
    • Environment:
      FreeBSD 10.3
    • CPU Architecture:
      x86-64
    • Kernel:
      Linux
    • Userland:
      GNU/Linux
    • Distribution:
      Debian
    • Distribution Version:
      Debian 8 jessie
    • Compiler:
      gcc
    • FreeSWITCH GIT Revision:
      726448d
    • GIT Master Revision hash::
      726448d
    • Target Version:

      Description

      Compiling on FreeBSD gives the following error:

      making all mod_avmd
      gmake[4]: Entering directory
      '/usr/home/fs/fs1.6/freeswitch/src/mod/applications/mod_avmd'
       CC mod_avmd_la-avmd_fast_acosf.lo
      avmd_fast_acosf.c:160:26: error: use of undeclared identifier 'MAP_POPULATE'
                 MAP_SHARED | MAP_POPULATE, /* read-ahead on the
      file. Later accesses to the mapping
                              ^
      1 error generated.
      gmake[4]: *** [Makefile:694: mod_avmd_la-avmd_fast_acosf.lo] Error 1
      gmake[4]: Leaving directory
      '/usr/home/fs/fs1.6/freeswitch/src/mod/applications/mod_avmd'
      gmake[3]: *** [Makefile:666: mod_avmd-all] Error 1
      gmake[3]: Leaving directory '/usr/home/fs/fs1.6/freeswitch/src/mod'
      gmake[2]: *** [Makefile:574: all-recursive] Error 1
      gmake[2]: Leaving directory '/usr/home/fs/fs1.6/freeswitch/src'
      gmake[1]: *** [Makefile:3131: all-recursive] Error 1
      gmake[1]: Leaving directory '/usr/home/fs/fs1.6/freeswitch'
      gmake: *** [Makefile:1410: all] Error 2

        Attachments

          Activity

            People

            • Assignee:
              piotrgregor Piotr Gregor
              Reporter:
              trumee Rajil Saraswat
            • Votes:
              0 Vote for this issue
              Watchers:
              2 Start watching this issue

              Dates

              • Created:
                Updated:
                Resolved: