Uploaded image for project: 'FreeSWITCH'
  1. FreeSWITCH
  2. FS-9581

git pull on 28/9/16 totally killed compile on windows

    Details

    • Type: Bug
    • Status: Resolved
    • Priority: Minor
    • Resolution: Fixed
    • Affects Version/s: 1.7
    • Fix Version/s: 1.8
    • Component/s: Build-System
    • Security Level: public
    • Labels:
      None
    • Environment:
      windows
    • CPU Architecture:
      x86-64, x86
    • Kernel:
      Linux, Microsoft Windows
    • Userland:
      Microsoft Windows
    • Distribution:
      Microsoft Windows
    • Distribution Version:
      Microsoft Windows 10
    • Compiler:
      Microsoft Visual Studio
    • FreeSWITCH GIT Revision:
      1.7
    • GIT Master Revision hash::
      yes

      Description

      i just did a git pull today and tried to build on windows and the whole build failed, attached is the log
      1. corelib.txt
        2 kB
        Bipin
      2. corelib.txt
        384 kB
        Bipin
      3. corelib3.txt
        2 kB
        Bipin
      4. failed.txt
        1.09 MB
        Bipin

        Activity

        Hide
        mikej Mike Jerris added a comment -
        give this a try again
        Show
        mikej Mike Jerris added a comment - give this a try again
        Hide
        xbipin Bipin added a comment -
        it compiles now but mod_managed still fails

        1>------ Build started: Project: mod_managed, Configuration: Release_CLR Win32 ------
        1> freeswitch_managed.cpp
        1> mod_managed.cpp
        1> Generating Code...
        1> freeswitch_wrap.cxx
        1> .NETFramework,Version=v4.0.AssemblyAttributes.cpp
        1> Creating library E:\FS\Win32\Release\mod\mod_managed.lib and object E:\FS\Win32\Release\mod\mod_managed.exp
        1>freeswitch_wrap.obj : error LNK2001: unresolved external symbol "extern "C" enum switch_status_t __stdcall switch_core_event_hook_add_text_read_frame(struct switch_core_session *,enum switch_status_t (__cdecl*)(struct switch_core_session *,struct switch_frame * *,unsigned int,int))" (?switch_core_event_hook_add_text_read_frame@@$$J18YG?AW4switch_status_t@@PAUswitch_core_session@@P6A?AW41@0PAPAUswitch_frame@@IH@Z@Z)
        1>freeswitch_wrap.obj : error LNK2001: unresolved external symbol "extern "C" enum switch_status_t __stdcall switch_core_event_hook_add_text_write_frame(struct switch_core_session *,enum switch_status_t (__cdecl*)(struct switch_core_session *,struct switch_frame *,unsigned int,int))" (?switch_core_event_hook_add_text_write_frame@@$$J18YG?AW4switch_status_t@@PAUswitch_core_session@@P6A?AW41@0PAUswitch_frame@@IH@Z@Z)
        1>freeswitch_wrap.obj : error LNK2001: unresolved external symbol "extern "C" enum switch_status_t __stdcall switch_core_event_hook_remove_text_read_frame(struct switch_core_session *,enum switch_status_t (__cdecl*)(struct switch_core_session *,struct switch_frame * *,unsigned int,int))" (?switch_core_event_hook_remove_text_read_frame@@$$J18YG?AW4switch_status_t@@PAUswitch_core_session@@P6A?AW41@0PAPAUswitch_frame@@IH@Z@Z)
        1>freeswitch_wrap.obj : error LNK2001: unresolved external symbol "extern "C" enum switch_status_t __stdcall switch_core_event_hook_remove_text_write_frame(struct switch_core_session *,enum switch_status_t (__cdecl*)(struct switch_core_session *,struct switch_frame *,unsigned int,int))" (?switch_core_event_hook_remove_text_write_frame@@$$J18YG?AW4switch_status_t@@PAUswitch_core_session@@P6A?AW41@0PAUswitch_frame@@IH@Z@Z)
        1>E:\FS\Win32\Release\mod\mod_managed.dll : fatal error LNK1120: 4 unresolved externals
        ========== Build: 0 succeeded, 1 failed, 0 up-to-date, 0 skipped ==========
        Show
        xbipin Bipin added a comment - it compiles now but mod_managed still fails 1>------ Build started: Project: mod_managed, Configuration: Release_CLR Win32 ------ 1> freeswitch_managed.cpp 1> mod_managed.cpp 1> Generating Code... 1> freeswitch_wrap.cxx 1> .NETFramework,Version=v4.0.AssemblyAttributes.cpp 1> Creating library E:\FS\Win32\Release\mod\mod_managed.lib and object E:\FS\Win32\Release\mod\mod_managed.exp 1>freeswitch_wrap.obj : error LNK2001: unresolved external symbol "extern "C" enum switch_status_t __stdcall switch_core_event_hook_add_text_read_frame(struct switch_core_session *,enum switch_status_t (__cdecl*)(struct switch_core_session *,struct switch_frame * *,unsigned int,int))" (?switch_core_event_hook_add_text_read_frame@@$$J18YG?AW4switch_status_t@@PAUswitch_core_session@@P6A?AW41@0PAPAUswitch_frame@@ IH@Z @Z) 1>freeswitch_wrap.obj : error LNK2001: unresolved external symbol "extern "C" enum switch_status_t __stdcall switch_core_event_hook_add_text_write_frame(struct switch_core_session *,enum switch_status_t (__cdecl*)(struct switch_core_session *,struct switch_frame *,unsigned int,int))" (?switch_core_event_hook_add_text_write_frame@@$$J18YG?AW4switch_status_t@@PAUswitch_core_session@@P6A?AW41@0PAUswitch_frame@@ IH@Z @Z) 1>freeswitch_wrap.obj : error LNK2001: unresolved external symbol "extern "C" enum switch_status_t __stdcall switch_core_event_hook_remove_text_read_frame(struct switch_core_session *,enum switch_status_t (__cdecl*)(struct switch_core_session *,struct switch_frame * *,unsigned int,int))" (?switch_core_event_hook_remove_text_read_frame@@$$J18YG?AW4switch_status_t@@PAUswitch_core_session@@P6A?AW41@0PAPAUswitch_frame@@ IH@Z @Z) 1>freeswitch_wrap.obj : error LNK2001: unresolved external symbol "extern "C" enum switch_status_t __stdcall switch_core_event_hook_remove_text_write_frame(struct switch_core_session *,enum switch_status_t (__cdecl*)(struct switch_core_session *,struct switch_frame *,unsigned int,int))" (?switch_core_event_hook_remove_text_write_frame@@$$J18YG?AW4switch_status_t@@PAUswitch_core_session@@P6A?AW41@0PAUswitch_frame@@ IH@Z @Z) 1>E:\FS\Win32\Release\mod\mod_managed.dll : fatal error LNK1120: 4 unresolved externals ========== Build: 0 succeeded, 1 failed, 0 up-to-date, 0 skipped ==========
        Hide
        mikej Mike Jerris added a comment -
        pushed some more.. try again
        Show
        mikej Mike Jerris added a comment - pushed some more.. try again
        Hide
        xbipin Bipin added a comment -
        compiles fine now except that old libv8 and mod_v8 issue which i just cant get rid of no matter what machine i try even with a fresh checkout
        Show
        xbipin Bipin added a comment - compiles fine now except that old libv8 and mod_v8 issue which i just cant get rid of no matter what machine i try even with a fresh checkout
        Hide
        mikej Mike Jerris added a comment -
        v8 is a separate issue.. check if its already open, if not, open a new jira on it
        Show
        mikej Mike Jerris added a comment - v8 is a separate issue.. check if its already open, if not, open a new jira on it

          People

          • Assignee:
            mikej Mike Jerris
            Reporter:
            xbipin Bipin
          • Votes:
            0 Vote for this issue
            Watchers:
            3 Start watching this issue

            Dates

            • Created:
              Updated:
              Resolved:

              Development